﻿Patient,Father_Name,Mother_Name,Previous_Last_Name,Previous_ID,Gender,Birth_Date,Departure_Date,Family_Status,Nationality,Nation,Birth_Country,Aliya_Year,Father_Origin,Mother_Origin,City,Street,House_No,Entrance,Apartment,Phone,Phone_Work,Phone_Cell,Phone_Fax,E_Mail,Mailing_Address,Zip,Entitled,Insurance_Type,District,Clinic,Immuned,Sensetivity_Checked_NA,Picture,Children,Alias,Pay_Institute,Referred_By,Department,Occupation,Clalit_Verified,Holocaust_Survivor,Genetic_Internal_No,Remarks,Agreement,Referring_Pay_Date,Hebrew_Birth_Date,Health_Ministry_Identification,Diagnosis_Death_Date,Diagnosis_Death_User,Diagnosis_Death_Remark,Allergies_Checked_NA,Patient_Image,Biohazard_Checked,Eligible,EligibilityCode,Religion,License_No,Country_Code,Country_Other,PO_Box,Language_Code,Language_Other,HandNum,African_American,Animal_Species,Animal_Type,Animal_Race,Animal_Color,English_FamilyName,English_GiveName,Personnel,Entry_Date,Entry_User,HebrewBirthDate,HebrewDeathDate
1,,,NULL,NULL,2,2000-01-01 00:00:00.000,NULL,0,NULL,NULL,NULL,NULL,NULL,NULL,NULL,,,,NULL,,NULL,,NULL,,,NULL,NULL,NULL,NULL,NULL,NULL,NULL,NULL,NULL,NULL,NULL,NULL,NULL,NULL,NULL,NULL,NULL,NULL,NULL,NULL,NULL,NULL,NULL,NULL,NULL,NULL,NULL,NULL,,,NULL,NULL,NULL,NULL,NULL,NULL,NULL,NULL,NULL,NULL,NULL,NULL,NULL,NULL,NULL,NULL,2019-01-10 17:41:51.720,NULL,NULL,
2,NULL,NULL,NULL,NULL,1,1980-05-01 00:00:00.000,NULL,NULL,NULL,NULL,NULL,NULL,NULL,NULL,NULL,NULL,NULL,NULL,NULL,NULL,NULL,NULL,NULL,NULL,NULL,NULL,NULL,NULL,NULL,NULL,NULL,NULL,NULL,NULL,NULL,NULL,NULL,NULL,NULL,NULL,NULL,NULL,NULL,NULL,NULL,NULL,NULL,NULL,NULL,NULL,NULL,NULL,NULL,,,NULL,NULL,NULL,NULL,NULL,NULL,NULL,NULL,NULL,NULL,NULL,NULL,NULL,ISRAELI,DANIEL,NULL,2022-07-12 15:55:06.003,1000,NULL,NULL
3,,,NULL,NULL,2,2010-01-01 00:00:00.000,NULL,0,NULL,NULL,NULL,NULL,NULL,NULL,NULL,,,,NULL,,NULL,,NULL,,,NULL,NULL,NULL,NULL,NULL,NULL,NULL,NULL,NULL,NULL,NULL,NULL,NULL,NULL,NULL,NULL,NULL,NULL,NULL,NULL,NULL,NULL,NULL,NULL,NULL,NULL,NULL,NULL,,,NULL,NULL,NULL,NULL,NULL,NULL,NULL,NULL,NULL,NULL,NULL,NULL,NULL,NULL,NULL,NULL,2019-01-15 12:24:45.127,NULL,NULL,NULL
4,,,NULL,NULL,2,1979-01-21 00:00:00.000,NULL,0,NULL,NULL,NULL,NULL,NULL,NULL,NULL,,,,NULL,,NULL,,NULL,,,NULL,NULL,NULL,NULL,NULL,NULL,NULL,NULL,NULL,NULL,NULL,NULL,NULL,NULL,NULL,NULL,NULL,NULL,NULL,NULL,NULL,NULL,NULL,NULL,NULL,NULL,NULL,NULL,,,NULL,NULL,NULL,NULL,NULL,NULL,NULL,NULL,NULL,NULL,NULL,NULL,NULL,NULL,NULL,NULL,2019-01-21 11:04:32.627,NULL,NULL,
5,,,NULL,NULL,1,1985-01-01 00:00:00.000,NULL,0,NULL,NULL,NULL,NULL,NULL,NULL,NULL,,,,NULL,,NULL,,NULL,,,NULL,NULL,NULL,NULL,NULL,NULL,NULL,NULL,NULL,NULL,NULL,NULL,NULL,NULL,NULL,NULL,NULL,NULL,NULL,NULL,NULL,NULL,NULL,NULL,NULL,NULL,NULL,NULL,,,NULL,NULL,NULL,NULL,NULL,NULL,NULL,NULL,NULL,NULL,NULL,NULL,NULL,NULL,NULL,NULL,2019-01-27 11:03:26.543,NULL,NULL,
6,,,NULL,NULL,1,1985-01-01 00:00:00.000,NULL,0,NULL,NULL,NULL,NULL,NULL,NULL,NULL,,,,NULL,,NULL,,NULL,,,NULL,NULL,NULL,NULL,NULL,NULL,NULL,NULL,NULL,NULL,NULL,NULL,NULL,NULL,NULL,NULL,NULL,NULL,NULL,NULL,NULL,NULL,NULL,NULL,NULL,NULL,NULL,NULL,,,NULL,NULL,NULL,NULL,NULL,NULL,NULL,NULL,NULL,NULL,NULL,NULL,NULL,NULL,NULL,NULL,2019-01-27 11:04:19.780,NULL,NULL,NULL
7,,,NULL,NULL,1,2010-01-01 00:00:00.000,NULL,0,NULL,NULL,NULL,NULL,NULL,NULL,NULL,,,,NULL,,NULL,,NULL,,,NULL,NULL,NULL,NULL,NULL,NULL,NULL,NULL,NULL,NULL,NULL,NULL,NULL,NULL,NULL,NULL,NULL,NULL,NULL,NULL,NULL,NULL,NULL,NULL,NULL,NULL,NULL,NULL,,,NULL,NULL,NULL,NULL,NULL,NULL,NULL,NULL,NULL,NULL,NULL,NULL,NULL,NULL,NULL,NULL,2019-01-29 14:30:03.270,NULL,NULL,NULL
8,,,NULL,NULL,2,2000-01-01 00:00:00.000,NULL,0,NULL,NULL,NULL,NULL,NULL,NULL,NULL,,,,NULL,,NULL,,NULL,,,NULL,NULL,NULL,NULL,NULL,NULL,NULL,NULL,NULL,NULL,NULL,NULL,NULL,NULL,NULL,NULL,NULL,NULL,NULL,NULL,NULL,NULL,NULL,NULL,NULL,NULL,NULL,NULL,,,NULL,NULL,NULL,NULL,NULL,NULL,NULL,NULL,NULL,NULL,NULL,NULL,NULL,NULL,NULL,NULL,2019-01-30 11:57:52.407,NULL,NULL,NULL
9,,,NULL,NULL,1,1998-02-01 00:00:00.000,NULL,0,NULL,NULL,NULL,NULL,NULL,NULL,NULL,,,,NULL,,NULL,,NULL,,,NULL,NULL,NULL,NULL,NULL,NULL,NULL,NULL,NULL,NULL,NULL,NULL,NULL,NULL,NULL,NULL,NULL,NULL,NULL,NULL,NULL,NULL,NULL,NULL,NULL,NULL,NULL,NULL,,,NULL,NULL,NULL,NULL,NULL,NULL,NULL,NULL,NULL,NULL,NULL,NULL,NULL,NULL,NULL,NULL,2019-02-04 17:53:35.753,NULL,NULL,NULL
10,NULL,NULL,NULL,NULL,1,1997-04-23 00:00:00.000,NULL,NULL,NULL,NULL,NULL,NULL,NULL,NULL,NULL,NULL,NULL,NULL,NULL,NULL,NULL,NULL,NULL,NULL,NULL,NULL,NULL,NULL,NULL,NULL,NULL,NULL,NULL,NULL,NULL,NULL,NULL,NULL,NULL,NULL,NULL,NULL,NULL,NULL,NULL,NULL,NULL,NULL,NULL,NULL,NULL,NULL,NULL,,,NULL,NULL,NULL,NULL,NULL,NULL,NULL,NULL,NULL,NULL,NULL,NULL,NULL,NULL,NULL,NULL,2020-11-08 11:11:56.670,NULL,NULL,NULL
11,,,NULL,NULL,1,1974-02-12 00:00:00.000,NULL,0,NULL,NULL,NULL,NULL,NULL,NULL,NULL,,,,NULL,,NULL,,NULL,,,NULL,NULL,NULL,NULL,NULL,NULL,NULL,NULL,NULL,NULL,NULL,NULL,NULL,NULL,NULL,NULL,NULL,NULL,NULL,NULL,NULL,NULL,NULL,NULL,NULL,NULL,NULL,NULL,,,NULL,NULL,NULL,NULL,NULL,NULL,NULL,NULL,NULL,NULL,NULL,NULL,NULL,NULL,NULL,NULL,2019-02-12 15:51:24.060,NULL,NULL,NULL
12,,,NULL,NULL,2,1957-07-04 00:00:00.000,NULL,0,NULL,NULL,NULL,NULL,NULL,NULL,NULL,,,,NULL,,NULL,,NULL,,,NULL,NULL,NULL,NULL,NULL,NULL,NULL,NULL,NULL,NULL,NULL,NULL,NULL,NULL,NULL,NULL,NULL,NULL,NULL,NULL,NULL,NULL,NULL,NULL,NULL,NULL,NULL,NULL,,,NULL,NULL,NULL,NULL,NULL,NULL,NULL,NULL,NULL,NULL,NULL,NULL,NULL,NULL,NULL,NULL,2019-02-13 13:07:54.240,NULL,NULL,
13,,,NULL,NULL,2,1980-02-01 00:00:00.000,NULL,0,NULL,NULL,NULL,NULL,NULL,NULL,NULL,,,,NULL,,NULL,,NULL,,,NULL,NULL,NULL,NULL,NULL,NULL,NULL,NULL,NULL,NULL,NULL,NULL,NULL,NULL,NULL,NULL,NULL,NULL,NULL,NULL,NULL,NULL,NULL,NULL,NULL,NULL,NULL,NULL,,,NULL,NULL,NULL,NULL,NULL,NULL,NULL,NULL,NULL,NULL,NULL,NULL,NULL,NULL,NULL,NULL,2019-02-17 12:56:11.770,NULL,NULL,NULL
14,,,NULL,NULL,2,2019-01-01 00:00:00.000,NULL,0,NULL,NULL,NULL,NULL,NULL,NULL,NULL,,,,NULL,,NULL,,NULL,,,NULL,NULL,NULL,NULL,NULL,NULL,NULL,NULL,NULL,NULL,NULL,NULL,NULL,NULL,NULL,NULL,NULL,NULL,NULL,NULL,NULL,NULL,NULL,NULL,NULL,NULL,NULL,NULL,,,NULL,NULL,NULL,NULL,NULL,NULL,NULL,NULL,NULL,NULL,NULL,NULL,NULL,NULL,NULL,NULL,2019-02-19 13:27:13.460,NULL,NULL,
15,,,NULL,NULL,1,1988-03-22 00:00:00.000,NULL,0,NULL,NULL,NULL,NULL,NULL,NULL,NULL,,,,NULL,,NULL,,NULL,,,NULL,NULL,NULL,NULL,NULL,NULL,NULL,NULL,NULL,NULL,NULL,NULL,NULL,NULL,NULL,NULL,NULL,NULL,NULL,NULL,NULL,NULL,NULL,NULL,NULL,NULL,NULL,NULL,,,NULL,NULL,NULL,NULL,NULL,NULL,NULL,NULL,NULL,NULL,NULL,NULL,NULL,NULL,NULL,NULL,2019-02-27 15:50:11.553,NULL,NULL,NULL
16,,,NULL,NULL,2,2000-01-01 00:00:00.000,NULL,0,NULL,NULL,NULL,NULL,NULL,NULL,NULL,,,,NULL,,NULL,,NULL,,,NULL,NULL,NULL,NULL,NULL,NULL,NULL,NULL,NULL,NULL,NULL,NULL,NULL,NULL,NULL,NULL,NULL,NULL,NULL,NULL,NULL,NULL,NULL,NULL,NULL,NULL,NULL,NULL,,,NULL,NULL,NULL,NULL,NULL,NULL,NULL,NULL,NULL,NULL,NULL,NULL,NULL,NULL,NULL,NULL,2019-03-05 14:12:09.427,NULL,NULL,NULL
17,,,NULL,NULL,1,2008-03-19 00:00:00.000,NULL,0,NULL,NULL,NULL,NULL,NULL,NULL,NULL,,,,NULL,,NULL,,NULL,,,NULL,NULL,NULL,NULL,NULL,NULL,NULL,NULL,NULL,NULL,NULL,NULL,NULL,NULL,NULL,NULL,NULL,NULL,NULL,NULL,NULL,NULL,NULL,NULL,NULL,NULL,NULL,NULL,,,NULL,NULL,NULL,NULL,NULL,NULL,NULL,NULL,NULL,NULL,NULL,NULL,NULL,NULL,NULL,NULL,2019-03-19 12:23:34.050,NULL,NULL,
18,,,NULL,NULL,1,1944-02-01 00:00:00.000,NULL,0,NULL,NULL,NULL,NULL,NULL,NULL,NULL,,,,NULL,,NULL,,NULL,,,NULL,NULL,NULL,NULL,NULL,NULL,NULL,NULL,NULL,NULL,NULL,NULL,NULL,NULL,NULL,NULL,NULL,NULL,NULL,NULL,NULL,NULL,NULL,NULL,NULL,NULL,NULL,NULL,,,NULL,NULL,NULL,NULL,NULL,NULL,NULL,NULL,NULL,NULL,NULL,NULL,NULL,NULL,NULL,NULL,2019-03-22 17:05:43.470,NULL,NULL,NULL
19,,,NULL,NULL,2,1977-05-04 00:00:00.000,NULL,0,NULL,NULL,NULL,NULL,NULL,NULL,NULL,,,,NULL,,NULL,,NULL,,,NULL,NULL,NULL,NULL,NULL,NULL,NULL,NULL,NULL,NULL,NULL,NULL,NULL,NULL,NULL,NULL,NULL,NULL,NULL,NULL,NULL,NULL,NULL,NULL,NULL,NULL,NULL,NULL,,,NULL,NULL,NULL,NULL,NULL,NULL,NULL,NULL,NULL,NULL,NULL,NULL,NULL,NULL,NULL,NULL,2019-03-22 17:06:47.763,NULL,NULL,NULL
20,,,NULL,NULL,1,2000-01-01 00:00:00.000,NULL,0,NULL,NULL,NULL,NULL,NULL,NULL,NULL,,,,NULL,,NULL,,NULL,,,NULL,NULL,NULL,NULL,NULL,NULL,NULL,NULL,NULL,NULL,NULL,NULL,NULL,NULL,NULL,NULL,NULL,NULL,NULL,NULL,NULL,NULL,NULL,NULL,NULL,NULL,NULL,NULL,,,NULL,NULL,NULL,NULL,NULL,NULL,NULL,NULL,NULL,NULL,NULL,NULL,NULL,NULL,NULL,NULL,2019-03-28 08:55:54.283,NULL,NULL,NULL
21,בסלי,NULL,NULL,NULL,1,1976-09-08 00:00:00.000,NULL,NULL,NULL,NULL,NULL,NULL,NULL,NULL,NULL,NULL,NULL,NULL,NULL,0512345678,NULL,NULL,NULL,NULL,NULL,NULL,NULL,NULL,NULL,NULL,NULL,NULL,NULL,NULL,NULL,NULL,NULL,NULL,NULL,NULL,NULL,NULL,NULL,NULL,NULL,NULL,NULL,NULL,NULL,NULL,NULL,NULL,NULL,,,NULL,NULL,NULL,NULL,NULL,NULL,NULL,NULL,NULL,NULL,NULL,NULL,NULL,NULL,NULL,NULL,2021-06-10 15:49:53.650,NULL,NULL,NULL
22,,,NULL,NULL,1,1970-01-01 00:00:00.000,NULL,0,NULL,NULL,NULL,NULL,NULL,NULL,NULL,,,,NULL,,NULL,,NULL,,,NULL,NULL,NULL,NULL,NULL,NULL,NULL,NULL,NULL,NULL,NULL,NULL,NULL,NULL,NULL,NULL,NULL,NULL,NULL,NULL,NULL,NULL,NULL,NULL,NULL,NULL,NULL,NULL,,,NULL,NULL,NULL,NULL,NULL,NULL,NULL,NULL,NULL,NULL,NULL,NULL,NULL,NULL,NULL,NULL,2019-03-28 13:01:23.413,6908,NULL,
23,,,NULL,NULL,2,1970-01-01 00:00:00.000,NULL,0,NULL,NULL,NULL,NULL,NULL,NULL,NULL,,,,NULL,,NULL,,NULL,,,NULL,NULL,NULL,NULL,NULL,NULL,NULL,NULL,NULL,NULL,NULL,NULL,NULL,NULL,NULL,NULL,NULL,NULL,NULL,NULL,NULL,NULL,NULL,NULL,NULL,NULL,NULL,NULL,,,NULL,NULL,NULL,NULL,NULL,NULL,NULL,NULL,NULL,NULL,NULL,NULL,NULL,NULL,NULL,NULL,2019-04-02 13:44:01.480,NULL,NULL,NULL
24,,,NULL,NULL,1,1970-01-01 00:00:00.000,NULL,0,NULL,NULL,NULL,NULL,NULL,NULL,NULL,,,,NULL,,NULL,,NULL,,,NULL,NULL,NULL,NULL,NULL,NULL,NULL,NULL,NULL,NULL,NULL,NULL,NULL,NULL,NULL,NULL,NULL,NULL,NULL,NULL,NULL,NULL,NULL,NULL,NULL,NULL,NULL,NULL,,,NULL,NULL,NULL,NULL,NULL,NULL,NULL,NULL,NULL,NULL,NULL,NULL,NULL,NULL,NULL,NULL,2019-04-03 07:53:40.330,NULL,NULL,NULL
25,,,NULL,NULL,2,2000-01-01 00:00:00.000,NULL,0,NULL,NULL,NULL,NULL,NULL,NULL,NULL,,,,NULL,,NULL,,NULL,,,NULL,NULL,NULL,NULL,NULL,NULL,NULL,NULL,NULL,NULL,NULL,NULL,NULL,NULL,NULL,NULL,NULL,NULL,NULL,NULL,NULL,NULL,NULL,NULL,NULL,NULL,NULL,NULL,,,NULL,NULL,NULL,NULL,NULL,NULL,NULL,NULL,NULL,NULL,NULL,NULL,NULL,NULL,NULL,NULL,2019-04-03 09:59:14.283,NULL,NULL,NULL
26,,,NULL,NULL,2,2012-02-01 00:00:00.000,NULL,0,NULL,NULL,NULL,NULL,NULL,NULL,NULL,,,,NULL,,NULL,,NULL,,,NULL,NULL,NULL,NULL,NULL,NULL,NULL,NULL,NULL,NULL,NULL,NULL,NULL,NULL,NULL,NULL,NULL,NULL,NULL,NULL,NULL,NULL,NULL,NULL,NULL,NULL,NULL,NULL,,,NULL,NULL,NULL,NULL,NULL,NULL,NULL,NULL,NULL,NULL,NULL,NULL,NULL,NULL,NULL,NULL,2019-04-07 07:52:53.947,NULL,NULL,
27,,,NULL,NULL,1,1982-04-07 00:00:00.000,NULL,0,NULL,NULL,NULL,NULL,NULL,NULL,NULL,,,,NULL,,NULL,,NULL,,,NULL,NULL,NULL,NULL,NULL,NULL,NULL,NULL,NULL,NULL,NULL,NULL,NULL,NULL,NULL,NULL,NULL,NULL,NULL,NULL,NULL,NULL,NULL,NULL,NULL,NULL,NULL,NULL,,,NULL,NULL,NULL,NULL,NULL,NULL,NULL,NULL,NULL,NULL,NULL,NULL,NULL,NULL,NULL,NULL,2019-04-07 11:03:49.293,NULL,NULL,NULL
28,,,NULL,NULL,2,1967-04-08 00:00:00.000,NULL,0,NULL,NULL,NULL,NULL,NULL,NULL,NULL,,,,NULL,,NULL,,NULL,,,NULL,NULL,NULL,NULL,NULL,NULL,NULL,NULL,NULL,NULL,NULL,NULL,NULL,NULL,NULL,NULL,NULL,NULL,NULL,NULL,NULL,NULL,NULL,NULL,NULL,NULL,NULL,NULL,,,NULL,NULL,NULL,NULL,NULL,NULL,NULL,NULL,NULL,NULL,NULL,NULL,NULL,NULL,NULL,NULL,2019-04-08 13:30:48.227,NULL,NULL,NULL
29,,,NULL,NULL,2,2000-01-01 00:00:00.000,NULL,0,NULL,NULL,NULL,NULL,NULL,NULL,NULL,,,,NULL,,NULL,,NULL,,,NULL,NULL,NULL,NULL,NULL,NULL,NULL,NULL,NULL,NULL,NULL,NULL,NULL,NULL,NULL,NULL,NULL,NULL,NULL,NULL,NULL,NULL,NULL,NULL,NULL,NULL,NULL,NULL,,,NULL,NULL,NULL,NULL,NULL,NULL,NULL,NULL,NULL,NULL,NULL,NULL,NULL,NULL,NULL,NULL,2019-04-08 15:56:12.137,NULL,NULL,NULL
30,,,NULL,NULL,2,1980-01-01 00:00:00.000,NULL,0,NULL,NULL,NULL,NULL,NULL,NULL,NULL,,,,NULL,,NULL,,NULL,,,NULL,NULL,NULL,NULL,NULL,NULL,NULL,NULL,NULL,NULL,NULL,NULL,NULL,NULL,NULL,NULL,NULL,NULL,NULL,NULL,NULL,NULL,NULL,NULL,NULL,NULL,NULL,NULL,,,NULL,NULL,NULL,NULL,NULL,NULL,NULL,NULL,NULL,NULL,NULL,NULL,NULL,NULL,NULL,NULL,2019-04-10 13:26:41.810,NULL,NULL,NULL
31,,,NULL,NULL,2,2000-01-01 00:00:00.000,NULL,0,NULL,NULL,NULL,NULL,NULL,NULL,NULL,,,,NULL,,NULL,,NULL,,,NULL,NULL,NULL,NULL,NULL,NULL,NULL,NULL,NULL,NULL,NULL,NULL,NULL,NULL,NULL,NULL,NULL,NULL,NULL,NULL,NULL,NULL,NULL,NULL,NULL,NULL,NULL,NULL,,,NULL,NULL,NULL,NULL,NULL,NULL,NULL,NULL,NULL,NULL,NULL,NULL,NULL,NULL,NULL,NULL,2019-04-17 10:24:17.557,NULL,NULL,NULL
32,,,NULL,NULL,1,2017-09-09 00:00:00.000,NULL,0,NULL,NULL,NULL,NULL,NULL,NULL,NULL,,,,NULL,,NULL,,NULL,,,NULL,NULL,NULL,NULL,NULL,NULL,NULL,NULL,NULL,NULL,NULL,NULL,NULL,NULL,NULL,NULL,NULL,NULL,NULL,NULL,NULL,NULL,NULL,NULL,NULL,NULL,NULL,NULL,,,NULL,NULL,NULL,NULL,NULL,NULL,NULL,NULL,NULL,NULL,NULL,NULL,NULL,NULL,NULL,NULL,2019-04-17 21:12:17.430,NULL,NULL,NULL
33,,,NULL,NULL,2,2010-01-01 00:00:00.000,NULL,0,NULL,NULL,NULL,NULL,NULL,NULL,NULL,,,,NULL,,NULL,,NULL,,,NULL,NULL,NULL,NULL,NULL,NULL,NULL,NULL,NULL,NULL,NULL,NULL,NULL,NULL,NULL,NULL,NULL,NULL,NULL,NULL,NULL,NULL,NULL,NULL,NULL,NULL,NULL,NULL,,,NULL,NULL,NULL,NULL,NULL,NULL,NULL,NULL,NULL,NULL,NULL,NULL,NULL,NULL,NULL,NULL,2019-04-18 12:13:19.673,NULL,NULL,NULL
34,,,NULL,NULL,2,1966-01-01 00:00:00.000,NULL,0,NULL,NULL,NULL,NULL,NULL,NULL,NULL,,,,NULL,,NULL,,NULL,,,NULL,NULL,NULL,NULL,NULL,NULL,NULL,NULL,NULL,NULL,NULL,NULL,NULL,NULL,NULL,NULL,NULL,NULL,NULL,NULL,NULL,NULL,NULL,NULL,NULL,NULL,NULL,NULL,,,NULL,NULL,NULL,NULL,NULL,NULL,NULL,NULL,NULL,NULL,NULL,NULL,NULL,NULL,NULL,NULL,2019-04-18 16:10:17.347,NULL,NULL,NULL
35,,,NULL,NULL,1,1975-01-01 00:00:00.000,NULL,0,NULL,NULL,NULL,NULL,NULL,NULL,NULL,,,,NULL,,NULL,,NULL,,,NULL,NULL,NULL,NULL,NULL,NULL,NULL,NULL,NULL,NULL,NULL,NULL,NULL,NULL,NULL,NULL,NULL,NULL,NULL,NULL,NULL,NULL,NULL,NULL,NULL,NULL,NULL,NULL,,,NULL,NULL,NULL,NULL,NULL,NULL,NULL,NULL,NULL,NULL,NULL,NULL,NULL,NULL,NULL,NULL,2019-04-21 10:24:10.850,NULL,NULL,NULL
36,,,NULL,NULL,2,2000-01-01 00:00:00.000,NULL,0,NULL,NULL,NULL,NULL,NULL,NULL,NULL,,,,NULL,,NULL,,NULL,,,NULL,NULL,NULL,NULL,NULL,NULL,NULL,NULL,NULL,NULL,NULL,NULL,NULL,NULL,NULL,NULL,NULL,NULL,NULL,NULL,NULL,NULL,NULL,NULL,NULL,NULL,NULL,NULL,,,NULL,NULL,NULL,NULL,NULL,NULL,NULL,NULL,NULL,NULL,NULL,NULL,NULL,NULL,NULL,NULL,2019-04-28 09:14:20.093,NULL,NULL,NULL
37,,,NULL,NULL,1,1987-05-05 00:00:00.000,NULL,0,NULL,NULL,NULL,NULL,NULL,NULL,NULL,,,,NULL,,NULL,,NULL,,,NULL,NULL,NULL,NULL,NULL,NULL,NULL,NULL,NULL,NULL,NULL,NULL,NULL,NULL,NULL,NULL,NULL,NULL,NULL,NULL,NULL,NULL,NULL,NULL,NULL,NULL,NULL,NULL,,,NULL,NULL,NULL,NULL,NULL,NULL,NULL,NULL,NULL,NULL,NULL,NULL,NULL,NULL,NULL,NULL,2019-04-28 13:21:11.660,NULL,NULL,NULL
38,,,NULL,NULL,1,1990-01-01 00:00:00.000,NULL,0,NULL,NULL,NULL,NULL,NULL,NULL,NULL,,,,NULL,,NULL,,NULL,,,NULL,NULL,NULL,NULL,NULL,NULL,NULL,NULL,NULL,NULL,NULL,NULL,NULL,NULL,NULL,NULL,NULL,NULL,NULL,NULL,NULL,NULL,NULL,NULL,NULL,NULL,NULL,NULL,,,NULL,NULL,NULL,NULL,NULL,NULL,NULL,NULL,NULL,NULL,NULL,NULL,NULL,NULL,NULL,NULL,2019-05-01 14:23:10.047,NULL,NULL,NULL
39,,,NULL,NULL,1,1987-05-06 00:00:00.000,NULL,0,NULL,NULL,NULL,NULL,NULL,NULL,NULL,,,,NULL,,NULL,,NULL,,,NULL,NULL,NULL,NULL,NULL,NULL,NULL,NULL,NULL,NULL,NULL,NULL,NULL,NULL,NULL,NULL,NULL,NULL,NULL,NULL,NULL,NULL,NULL,NULL,NULL,NULL,NULL,NULL,,,NULL,NULL,NULL,NULL,NULL,NULL,NULL,NULL,NULL,NULL,NULL,NULL,NULL,NULL,NULL,NULL,2019-05-05 13:14:38.847,NULL,NULL,NULL
40,,,NULL,NULL,1,1978-05-07 00:00:00.000,NULL,0,NULL,NULL,NULL,NULL,NULL,NULL,NULL,,,,NULL,,NULL,,NULL,,,NULL,NULL,NULL,NULL,NULL,NULL,NULL,NULL,NULL,NULL,NULL,NULL,NULL,NULL,NULL,NULL,NULL,NULL,NULL,NULL,NULL,NULL,NULL,NULL,NULL,NULL,NULL,NULL,,,NULL,NULL,NULL,NULL,NULL,NULL,NULL,NULL,NULL,NULL,NULL,NULL,NULL,NULL,NULL,NULL,2019-05-07 12:40:58.537,NULL,NULL,NULL
41,,,NULL,NULL,1,2016-09-20 00:00:00.000,NULL,0,NULL,NULL,NULL,NULL,NULL,NULL,NULL,,,,NULL,,NULL,,NULL,,,NULL,NULL,NULL,NULL,NULL,NULL,NULL,NULL,NULL,NULL,NULL,NULL,NULL,NULL,NULL,NULL,NULL,NULL,NULL,NULL,NULL,NULL,NULL,NULL,NULL,NULL,NULL,NULL,,,NULL,NULL,NULL,NULL,NULL,NULL,NULL,NULL,NULL,NULL,NULL,NULL,NULL,NULL,NULL,NULL,2019-05-12 08:48:16.650,NULL,NULL,NULL
42,,,NULL,NULL,2,2000-01-01 00:00:00.000,NULL,0,NULL,NULL,NULL,NULL,NULL,NULL,NULL,,,,NULL,,NULL,,NULL,,,NULL,NULL,NULL,NULL,NULL,NULL,NULL,NULL,NULL,NULL,NULL,NULL,NULL,NULL,NULL,NULL,NULL,NULL,NULL,NULL,NULL,NULL,NULL,NULL,NULL,NULL,NULL,NULL,,,NULL,NULL,NULL,NULL,NULL,NULL,NULL,NULL,NULL,NULL,NULL,NULL,NULL,NULL,NULL,NULL,2019-05-13 09:06:06.000,NULL,NULL,NULL
43,,,NULL,NULL,2,1954-09-18 00:00:00.000,NULL,0,NULL,NULL,NULL,NULL,NULL,NULL,NULL,,,,NULL,,NULL,,NULL,,,NULL,NULL,NULL,NULL,NULL,NULL,NULL,NULL,NULL,NULL,NULL,NULL,NULL,NULL,NULL,NULL,NULL,NULL,NULL,NULL,NULL,NULL,NULL,NULL,NULL,NULL,NULL,NULL,,,NULL,NULL,NULL,NULL,NULL,NULL,NULL,NULL,NULL,NULL,NULL,NULL,NULL,NULL,NULL,NULL,2019-05-13 16:52:09.750,NULL,NULL,NULL
44,,,NULL,NULL,1,1956-02-02 00:00:00.000,NULL,0,NULL,NULL,NULL,NULL,NULL,NULL,NULL,,,,NULL,,NULL,,NULL,,,NULL,NULL,NULL,NULL,NULL,NULL,NULL,NULL,NULL,NULL,NULL,NULL,NULL,NULL,NULL,NULL,NULL,NULL,NULL,NULL,NULL,NULL,NULL,NULL,NULL,NULL,NULL,NULL,,,NULL,NULL,NULL,NULL,NULL,NULL,NULL,NULL,NULL,NULL,NULL,NULL,NULL,NULL,NULL,NULL,2019-05-15 16:19:37.810,NULL,NULL,NULL
45,,,NULL,NULL,2,1995-05-10 00:00:00.000,NULL,0,NULL,NULL,NULL,NULL,NULL,NULL,NULL,,,,NULL,,NULL,,NULL,,,NULL,NULL,NULL,NULL,NULL,NULL,NULL,NULL,NULL,NULL,NULL,NULL,NULL,NULL,NULL,NULL,NULL,NULL,NULL,NULL,NULL,NULL,NULL,NULL,NULL,NULL,NULL,NULL,,,NULL,NULL,NULL,NULL,NULL,NULL,NULL,NULL,NULL,NULL,NULL,NULL,NULL,NULL,NULL,NULL,2019-05-16 09:25:51.317,NULL,NULL,NULL
46,לומלום,,NULL,NULL,2,1956-05-03 00:00:00.000,NULL,0,NULL,0,NULL,NULL,NULL,NULL,NULL," ",,,NULL,03-7482444,NULL,054-6208649,NULL,,,NULL,NULL,NULL,NULL,NULL,NULL,NULL,NULL,0,NULL,10,NULL,NULL,NULL,NULL,NULL,NULL,NULL,NULL,NULL,NULL,NULL,NULL,NULL,NULL,NULL,NULL,NULL,,,NULL,NULL,NULL,NULL,NULL,NULL,NULL,NULL,NULL,NULL,NULL,NULL,NULL,NULL,NULL,NULL,2020-05-06 00:30:23.737,NULL,NULL,NULL
47,NULL,NULL,NULL,NULL,1,1990-02-02 00:00:00.000,NULL,NULL,NULL,NULL,NULL,NULL,NULL,NULL,NULL,NULL,NULL,NULL,NULL,NULL,NULL,NULL,NULL,NULL,NULL,NULL,NULL,NULL,NULL,NULL,NULL,NULL,NULL,NULL,NULL,2,NULL,NULL,NULL,NULL,NULL,NULL,NULL,NULL,NULL,NULL,NULL,NULL,NULL,NULL,NULL,NULL,NULL,,,NULL,NULL,NULL,NULL,NULL,NULL,NULL,NULL,NULL,NULL,NULL,NULL,NULL,NULL,NULL,NULL,2020-04-26 10:34:53.380,NULL,NULL,
48,,,NULL,NULL,1,2000-01-01 00:00:00.000,NULL,0,NULL,NULL,NULL,NULL,NULL,NULL,NULL,,,,NULL,,NULL,,NULL,,,NULL,NULL,NULL,NULL,NULL,NULL,NULL,NULL,NULL,NULL,NULL,NULL,NULL,NULL,NULL,NULL,NULL,NULL,NULL,NULL,NULL,NULL,NULL,NULL,NULL,NULL,NULL,NULL,,,NULL,NULL,NULL,NULL,NULL,NULL,NULL,NULL,NULL,NULL,NULL,NULL,NULL,NULL,NULL,NULL,2019-05-22 13:17:13.247,NULL,NULL,
49,,,NULL,NULL,1,2000-05-05 00:00:00.000,NULL,0,NULL,NULL,NULL,NULL,NULL,NULL,NULL,,,,NULL,,NULL,,NULL,,,NULL,NULL,NULL,NULL,NULL,NULL,NULL,NULL,NULL,NULL,NULL,NULL,NULL,NULL,NULL,NULL,NULL,NULL,NULL,NULL,NULL,NULL,NULL,NULL,NULL,NULL,NULL,NULL,,,NULL,NULL,NULL,NULL,NULL,NULL,NULL,NULL,NULL,NULL,NULL,NULL,NULL,NULL,NULL,NULL,2019-05-30 11:41:13.510,NULL,NULL,NULL
50,,,NULL,NULL,2,1970-12-12 00:00:00.000,NULL,0,NULL,NULL,NULL,NULL,NULL,NULL,NULL,,,,NULL,,NULL,,NULL,,,NULL,NULL,NULL,NULL,NULL,NULL,NULL,NULL,NULL,NULL,NULL,NULL,NULL,NULL,NULL,NULL,NULL,NULL,NULL,NULL,NULL,NULL,NULL,NULL,NULL,NULL,NULL,NULL,,,NULL,NULL,NULL,NULL,NULL,NULL,NULL,NULL,NULL,NULL,NULL,NULL,NULL,NULL,NULL,NULL,2019-05-30 13:08:11.560,NULL,NULL,NULL
51,,,NULL,NULL,1,1970-12-12 00:00:00.000,NULL,0,NULL,NULL,NULL,NULL,NULL,NULL,NULL,,,,NULL,,NULL,,NULL,,,NULL,NULL,NULL,NULL,NULL,NULL,NULL,NULL,NULL,NULL,NULL,NULL,NULL,NULL,NULL,NULL,NULL,NULL,NULL,NULL,NULL,NULL,NULL,NULL,NULL,NULL,NULL,NULL,,,NULL,NULL,NULL,NULL,NULL,NULL,NULL,NULL,NULL,NULL,NULL,NULL,NULL,NULL,NULL,NULL,2019-05-30 13:11:48.720,NULL,NULL,NULL
52,,,NULL,NULL,2,2000-01-01 00:00:00.000,NULL,0,NULL,NULL,NULL,NULL,NULL,NULL,NULL,,,,NULL,,NULL,,NULL,,,NULL,NULL,NULL,NULL,NULL,NULL,NULL,NULL,NULL,NULL,NULL,NULL,NULL,NULL,NULL,NULL,NULL,NULL,NULL,NULL,NULL,NULL,NULL,NULL,NULL,NULL,NULL,NULL,,,NULL,NULL,NULL,NULL,NULL,NULL,NULL,NULL,NULL,NULL,NULL,NULL,NULL,NULL,NULL,NULL,2019-05-30 15:32:26.187,NULL,NULL,NULL
53,,,NULL,NULL,2,1996-01-01 00:00:00.000,NULL,0,NULL,NULL,NULL,NULL,NULL,NULL,NULL,,,,NULL,,NULL,,NULL,,,NULL,NULL,NULL,NULL,NULL,NULL,NULL,NULL,NULL,NULL,NULL,NULL,NULL,NULL,NULL,NULL,NULL,NULL,NULL,NULL,NULL,NULL,NULL,NULL,NULL,NULL,NULL,NULL,,,NULL,NULL,NULL,NULL,NULL,NULL,NULL,NULL,NULL,NULL,NULL,NULL,NULL,NULL,NULL,NULL,2019-06-03 07:24:46.000,NULL,NULL,NULL
54,NULL,NULL,NULL,NULL,2,2000-01-01 00:00:00.000,NULL,NULL,NULL,NULL,NULL,NULL,NULL,NULL,NULL,NULL,NULL,NULL,NULL,NULL,NULL,NULL,NULL,NULL,NULL,NULL,NULL,NULL,NULL,NULL,NULL,NULL,NULL,NULL,NULL,NULL,NULL,NULL,NULL,NULL,NULL,NULL,NULL,NULL,NULL,NULL,NULL,NULL,NULL,NULL,NULL,NULL,NULL,,,NULL,NULL,NULL,NULL,NULL,NULL,NULL,NULL,NULL,NULL,NULL,NULL,NULL,NULL,NULL,NULL,2021-06-21 09:11:00.757,NULL,NULL,
55,,,NULL,NULL,1,2008-06-03 00:00:00.000,NULL,0,NULL,NULL,NULL,NULL,NULL,NULL,NULL,,,,NULL,,NULL,,NULL,,,NULL,NULL,NULL,NULL,NULL,NULL,NULL,NULL,NULL,NULL,NULL,NULL,NULL,NULL,NULL,NULL,NULL,NULL,NULL,NULL,NULL,NULL,NULL,NULL,NULL,NULL,NULL,NULL,,,NULL,NULL,NULL,NULL,NULL,NULL,NULL,NULL,NULL,NULL,NULL,NULL,NULL,NULL,NULL,NULL,2019-06-04 07:35:15.950,NULL,NULL,NULL
56,,,NULL,NULL,1,2010-09-09 00:00:00.000,NULL,0,NULL,NULL,NULL,NULL,NULL,NULL,NULL,,,,NULL,,NULL,,NULL,,,NULL,NULL,NULL,NULL,NULL,NULL,NULL,NULL,NULL,NULL,NULL,NULL,NULL,NULL,NULL,NULL,NULL,NULL,NULL,NULL,NULL,NULL,NULL,NULL,NULL,NULL,NULL,NULL,,,NULL,NULL,NULL,NULL,NULL,NULL,NULL,NULL,NULL,NULL,NULL,NULL,NULL,NULL,NULL,NULL,2019-06-16 14:02:32.517,NULL,NULL,NULL
57,,,NULL,NULL,2,1954-02-01 00:00:00.000,NULL,0,NULL,NULL,NULL,NULL,NULL,NULL,NULL,,,,NULL,,NULL,,NULL,,,NULL,NULL,NULL,NULL,NULL,NULL,NULL,NULL,NULL,NULL,NULL,NULL,NULL,NULL,NULL,NULL,NULL,NULL,NULL,NULL,NULL,NULL,NULL,NULL,NULL,NULL,NULL,NULL,,,NULL,NULL,NULL,NULL,NULL,NULL,NULL,NULL,NULL,NULL,NULL,NULL,NULL,NULL,NULL,NULL,2019-06-23 13:47:49.207,NULL,NULL,
58,NULL,NULL,NULL,NULL,2,2000-05-02 00:00:00.000,NULL,NULL,NULL,NULL,NULL,NULL,NULL,NULL,NULL,NULL,NULL,NULL,NULL,NULL,NULL,NULL,NULL,NULL,NULL,NULL,NULL,NULL,NULL,NULL,NULL,NULL,NULL,NULL,NULL,11,NULL,NULL,NULL,NULL,NULL,NULL,NULL,NULL,NULL,NULL,NULL,NULL,NULL,NULL,NULL,NULL,NULL,,,NULL,NULL,NULL,NULL,NULL,NULL,NULL,NULL,NULL,NULL,NULL,NULL,NULL,NULL,NULL,NULL,2020-06-18 18:40:21.423,NULL,NULL,NULL
59,,,NULL,NULL,1,2001-06-30 00:00:00.000,NULL,0,NULL,NULL,NULL,NULL,NULL,NULL,NULL,,,,NULL,,NULL,,NULL,,,NULL,NULL,NULL,NULL,NULL,NULL,NULL,NULL,NULL,NULL,NULL,NULL,NULL,NULL,NULL,NULL,NULL,NULL,NULL,NULL,NULL,NULL,NULL,NULL,NULL,NULL,NULL,NULL,,,NULL,NULL,NULL,NULL,NULL,NULL,NULL,NULL,NULL,NULL,NULL,NULL,NULL,NULL,NULL,NULL,2019-06-30 10:20:43.620,NULL,NULL,NULL
60,,,NULL,NULL,2,1972-11-11 00:00:00.000,NULL,0,NULL,NULL,NULL,NULL,NULL,NULL,NULL,,,,NULL,,NULL,,NULL,,,NULL,NULL,NULL,NULL,NULL,NULL,NULL,NULL,NULL,NULL,NULL,NULL,NULL,NULL,NULL,NULL,NULL,NULL,NULL,NULL,NULL,NULL,NULL,NULL,NULL,NULL,NULL,NULL,,,NULL,NULL,NULL,NULL,NULL,NULL,NULL,NULL,NULL,NULL,NULL,NULL,NULL,NULL,NULL,NULL,2019-07-03 08:33:38.287,NULL,NULL,
61,,,NULL,NULL,2,1974-07-04 00:00:00.000,NULL,0,NULL,NULL,NULL,NULL,NULL,NULL,NULL,,,,NULL,,NULL,,NULL,,,NULL,NULL,NULL,NULL,NULL,NULL,NULL,NULL,NULL,NULL,NULL,NULL,NULL,NULL,NULL,NULL,NULL,NULL,NULL,NULL,NULL,NULL,NULL,NULL,NULL,NULL,NULL,NULL,,,NULL,NULL,NULL,NULL,NULL,NULL,NULL,NULL,NULL,NULL,NULL,NULL,NULL,NULL,NULL,NULL,2019-07-04 13:32:55.103,NULL,NULL,NULL
62,,,NULL,NULL,1,1987-10-12 00:00:00.000,NULL,0,NULL,NULL,NULL,NULL,NULL,NULL,NULL,,,,NULL,,NULL,,NULL,,,NULL,NULL,NULL,NULL,NULL,NULL,NULL,NULL,NULL,NULL,NULL,NULL,NULL,NULL,NULL,NULL,NULL,NULL,NULL,NULL,NULL,NULL,NULL,NULL,NULL,NULL,NULL,NULL,,,NULL,NULL,NULL,NULL,NULL,NULL,NULL,NULL,NULL,NULL,NULL,NULL,NULL,NULL,NULL,NULL,2019-07-17 14:42:42.300,NULL,NULL,NULL